Reaction Details
TargetAdenosine receptor A2a
LigandBDBM50176050
Substrate/Competitorn/a
Meas. Tech.ChEMBL_575569 (CHEMBL1036412)
Ki 36±n/a nM
Citation Gillespie, RJBamford, SJGaur, SJordan, AMLerpiniere, JMansell, HLStratton, GC Antagonists of the human A(2A) receptor. Part 5: Highly bio-available pyrimidine-4-carboxamides. Bioorg Med Chem Lett19:2664-7 (2009) 
 
Adenosine receptor A2a
Name:Adenosine receptor A2a
Type:G Protein-Coupled Receptor (GPCR)
Mol. Mass.:44716.46
Organism:Homo sapiens (Human)
Description:P29274
Residue:412
BDBM50176050
NameBDBM50176050
Synonyms:8-(3,4-dimethoxystyryl)-1,3-diethyl-7-methyl-1H-purine-2,6(3H,7H)-dione 8-[2-(3,4-dimethoxy-phenyl)-vinyl]-1,3-diethyl-7-methyl-3,9-dihydro-purine-2,6-dione US11806350, Compound Istradefylline | istradefylline
TypeSmall organic molecule
Emp. Form.C20H24N4O4
Mol. Mass.384.429
SMILESCCn1c2nc(\C=C\c3ccc(OC)c(OC)c3)n(C)c2c(=O)n(CC)c1=O