Reaction Details
TargetCarbonic anhydrase 2
LigandBDBM50067895
Substrate/Competitorn/a
Meas. Tech.ChEMBL_575787 (CHEMBL950887)
Ki 10800±n/a nM
Citation Innocenti, AWinum, JYHall, RAMühlschlegel, FAScozzafava, ASupuran, CT Carbonic anhydrase inhibitors. Inhibition of the fungal beta-carbonic anhydrases from Candida albicans and Cryptococcus neoformans with boronic acids. Bioorg Med Chem Lett19:2642-5 (2009) 
 
Carbonic anhydrase 2
Name:Carbonic anhydrase 2
Type:Enzyme
Mol. Mass.:29250.71
Organism:Homo sapiens (Human)
Description:P00918
Residue:260
BDBM50067895
NameBDBM50067895
Synonyms:CHEMBL140780 p-tolylboronic acid
TypeSmall organic molecule
Emp. Form.C7H9BO2
Mol. Mass.135.956
SMILESCc1ccc(cc1)B(O)O