Reaction Details
TargetProkineticin receptor 1
LigandBDBM50294594
Substrate/Competitorn/a
Meas. Tech.ChEMBL_575799 (CHEMBL1057723)
IC50 2860±n/a nM
Citation Ralbovsky, JLLisko, JGPalmer, JMMabus, JChevalier, KMSchulz, MJDyatkin, ABMiskowski, TACoats, SJHornby, PHe, W Triazinediones as prokineticin 1 receptor antagonists. Part 1: SAR, synthesis and biological evaluation. Bioorg Med Chem Lett19:2661-3 (2009) 
 
Prokineticin receptor 1
Name:Prokineticin receptor 1
Type:enzyme
Mol. Mass.:44779.92
Organism:Homo sapiens (Human)
Description:Q8TCW9
Residue:393
BDBM50294594
NameBDBM50294594
Synonyms:1-(2-(5-(4-fluorobenzyl)-1-(4-methoxyphenethyl)-4,6-dioxo-1,4,5,6-tetrahydro-1,3,5-triazin-2-ylamino)ethyl)guanidine | CHEMBL560053
TypeSmall organic molecule
Emp. Form.C22H26FN7O3
Mol. Mass.455.4853
SMILES[#6]-[#8]-c1ccc(-[#6]-[#6]-n2c(-[#7]-[#6]-[#6]\[#7]=[#6](\[#7])-[#7])nc(=O)n(-[#6]-c3ccc(F)cc3)c2=O)cc1