Reaction Details
TargetProkineticin receptor 1
LigandBDBM50294599
Substrate/Competitorn/a
Meas. Tech.ChEMBL_575799 (CHEMBL1057723)
IC50 6510±n/a nM
Citation Ralbovsky, JLLisko, JGPalmer, JMMabus, JChevalier, KMSchulz, MJDyatkin, ABMiskowski, TACoats, SJHornby, PHe, W Triazinediones as prokineticin 1 receptor antagonists. Part 1: SAR, synthesis and biological evaluation. Bioorg Med Chem Lett19:2661-3 (2009) 
 
Prokineticin receptor 1
Name:Prokineticin receptor 1
Type:enzyme
Mol. Mass.:44779.92
Organism:Homo sapiens (Human)
Description:Q8TCW9
Residue:393
BDBM50294599
NameBDBM50294599
Synonyms:1-(2-(5-(3,4-dichlorobenzyl)-1-hexyl-4,6-dioxo-1,4,5,6-tetrahydro-1,3,5-triazin-2-ylamino)ethyl)guanidine | CHEMBL560451
TypeSmall organic molecule
Emp. Form.C19H27Cl2N7O2
Mol. Mass.456.369
SMILES[#6]-[#6]-[#6]-[#6]-[#6]-[#6]-n1c(-[#7]-[#6]-[#6]\[#7]=[#6](\[#7])-[#7])nc(=O)n(-[#6]-c2ccc(Cl)c(Cl)c2)c1=O