Reaction Details
TargetProkineticin receptor 1
LigandBDBM50294600
Substrate/Competitorn/a
Meas. Tech.ChEMBL_575799 (CHEMBL1057723)
IC50 3260±n/a nM
Citation Ralbovsky, JLLisko, JGPalmer, JMMabus, JChevalier, KMSchulz, MJDyatkin, ABMiskowski, TACoats, SJHornby, PHe, W Triazinediones as prokineticin 1 receptor antagonists. Part 1: SAR, synthesis and biological evaluation. Bioorg Med Chem Lett19:2661-3 (2009) 
 
Prokineticin receptor 1
Name:Prokineticin receptor 1
Type:enzyme
Mol. Mass.:44779.92
Organism:Homo sapiens (Human)
Description:Q8TCW9
Residue:393
BDBM50294600
NameBDBM50294600
Synonyms:1-(2-(5-(4-methoxybenzyl)-1-((4-methoxycyclohexyl)methyl)-4,6-dioxo-1,4,5,6-tetrahydro-1,3,5-triazin-2-ylamino)ethyl)guanidine | CHEMBL550034
TypeSmall organic molecule
Emp. Form.C22H33N7O4
Mol. Mass.459.5419
SMILESCOC1CCC(Cn2c(NCCN=C(N)N)nc(=O)n(Cc3ccc(OC)cc3)c2=O)CC1