Reaction Details
TargetProkineticin receptor 1
LigandBDBM50294602
Substrate/Competitorn/a
Meas. Tech.ChEMBL_575799 (CHEMBL1057723)
IC50 1870±n/a nM
Citation Ralbovsky, JLLisko, JGPalmer, JMMabus, JChevalier, KMSchulz, MJDyatkin, ABMiskowski, TACoats, SJHornby, PHe, W Triazinediones as prokineticin 1 receptor antagonists. Part 1: SAR, synthesis and biological evaluation. Bioorg Med Chem Lett19:2661-3 (2009) 
 
Prokineticin receptor 1
Name:Prokineticin receptor 1
Type:enzyme
Mol. Mass.:44779.92
Organism:Homo sapiens (Human)
Description:Q8TCW9
Residue:393
BDBM50294602
NameBDBM50294602
Synonyms:1-(2-(5-(4-chlorobenzyl)-1-(furan-3-yl)-4,6-dioxo-1,4,5,6-tetrahydro-1,3,5-triazin-2-ylamino)ethyl)guanidine | CHEMBL563890
TypeSmall organic molecule
Emp. Form.C17H18ClN7O3
Mol. Mass.403.823
SMILES[#7]\[#6](-[#7])=[#7]\[#6]-[#6]-[#7]-c1nc(=O)n(-[#6]-c2ccc(Cl)cc2)c(=O)n1-c1ccoc1