Reaction Details
TargetProkineticin receptor 1
LigandBDBM50294603
Substrate/Competitorn/a
Meas. Tech.ChEMBL_575799 (CHEMBL1057723)
IC50 51±n/a nM
Citation Ralbovsky, JLLisko, JGPalmer, JMMabus, JChevalier, KMSchulz, MJDyatkin, ABMiskowski, TACoats, SJHornby, PHe, W Triazinediones as prokineticin 1 receptor antagonists. Part 1: SAR, synthesis and biological evaluation. Bioorg Med Chem Lett19:2661-3 (2009) 
 
Prokineticin receptor 1
Name:Prokineticin receptor 1
Type:enzyme
Mol. Mass.:44779.92
Organism:Homo sapiens (Human)
Description:Q8TCW9
Residue:393
BDBM50294603
NameBDBM50294603
Synonyms:1-(2-(5-(4-methoxybenzyl)-1-((6-methoxypyridin-3-yl)methyl)-4,6-dioxo-1,4,5,6-tetrahydro-1,3,5-triazin-2-ylamino)ethyl)guanidine | CHEMBL559719
TypeSmall organic molecule
Emp. Form.C21H26N8O4
Mol. Mass.454.4823
SMILES[#6]-[#8]-c1ccc(-[#6]-n2c(=O)nc(-[#7]-[#6]-[#6]\[#7]=[#6](\[#7])-[#7])n(-[#6]-c3ccc(-[#8]-[#6])nc3)c2=O)cc1