Reaction Details
TargetAdenosine receptor A3
LigandBDBM50214974
Substrate/Competitorn/a
Meas. Tech.ChEMBL_575807 (CHEMBL1024508)
Ki 4.16±n/a nM
Citation Pal, SChoi, WJChoe, SAHeller, CLGao, ZGChinn, MJacobson, KAHou, XLee, SKKim, HOJeong, LS Structure-activity relationships of truncated adenosine derivatives as highly potent and selective human A3 adenosine receptor antagonists. Bioorg Med Chem17:3733-8 (2009) 
 
Adenosine receptor A3
Name:Adenosine receptor A3
Type:G Protein-Coupled Receptor (GPCR)
Mol. Mass.:36197.32
Organism:Homo sapiens (Human)
Description:P0DMS8
Residue:318
BDBM50214974
NameBDBM50214974
Synonyms:(2R,3R,4S)-2-(2-chloro-6-(3-iodobenzylamino)-9H-purin-9-yl)tetrahydrothiophene3,4-diol CHEMBL413686
TypeSmall organic molecule
Emp. Form.C16H15ClIN5O2S
Mol. Mass.503.745
SMILESO[C@@H]1CS[C@H]([C@@H]1O)n1cnc2c(NCc3cccc(I)c3)nc(Cl)nc12