Reaction Details
Target11-beta-hydroxysteroid dehydrogenase 1
LigandBDBM50294765
Substrate/Competitorn/a
Meas. Tech.ChEMBL_576303 (CHEMBL1030305)
IC50 17±n/a nM
Citation Roche, DCarniato, DLeriche, CLepifre, FChristmann-Franck, SGraedler, UCharon, CBozec, SDoare, LSchmidlin, FLecomte, MValeur, E Discovery and structure-activity relationships of pentanedioic acid diamides as potent inhibitors of 11beta-hydroxysteroid dehydrogenase type I. Bioorg Med Chem Lett19:2674-8 (2009) 
 
11-beta-hydroxysteroid dehydrogenase 1
Name:11-beta-hydroxysteroid dehydrogenase 1
Type:Enzyme
Mol. Mass.:32409.16
Organism:Homo sapiens (Human)
Description:P28845
Residue:292
BDBM50294765
NameBDBM50294765
Synonyms:CHEMBL551306 | N-Adamantan-2-yl-2-{1-[(4-fluoro-phenylcarbamoyl)-methyl]-cyclopentyl}-acetamide
TypeSmall organic molecule
Emp. Form.C25H33FN2O2
Mol. Mass.412.5401
SMILESFc1ccc(NC(=O)CC2(CC(=O)NC3C4CC5CC(C4)CC3C5)CCCC2)cc1