Reaction Details
Target11-beta-hydroxysteroid dehydrogenase 1
LigandBDBM50294771
Substrate/Competitorn/a
Meas. Tech.ChEMBL_576303 (CHEMBL1030305)
IC50 9±n/a nM
Citation Roche, DCarniato, DLeriche, CLepifre, FChristmann-Franck, SGraedler, UCharon, CBozec, SDoare, LSchmidlin, FLecomte, MValeur, E Discovery and structure-activity relationships of pentanedioic acid diamides as potent inhibitors of 11beta-hydroxysteroid dehydrogenase type I. Bioorg Med Chem Lett19:2674-8 (2009) 
 
11-beta-hydroxysteroid dehydrogenase 1
Name:11-beta-hydroxysteroid dehydrogenase 1
Type:Enzyme
Mol. Mass.:32409.16
Organism:Homo sapiens (Human)
Description:P28845
Residue:292
BDBM50294771
NameBDBM50294771
Synonyms:CHEMBL549419 | N-Adamantan-2-yl-2-[1-(isobutylcarbamoyl-methyl)-cyclopentyl]-acetamide
TypeSmall organic molecule
Emp. Form.C23H38N2O2
Mol. Mass.374.56
SMILESCC(C)CNC(=O)CC1(CC(=O)NC2C3CC4CC(C3)CC2C4)CCCC1