Reaction Details
TargetHypoxia-inducible factor 1-alpha
LigandBDBM50414393
Substrate/Competitorn/a
Meas. Tech.ChEMBL_576753 (CHEMBL1032020)
IC50 47±n/a nM
Citation Kasper, ACMoon, EJHu, XPark, YWooten, CMKim, HYang, WDewhirst, MWHong, J Analysis of HIF-1 inhibition by manassantin A and analogues with modified tetrahydrofuran configurations. Bioorg Med Chem Lett19:3783-6 (2009) 
 
Hypoxia-inducible factor 1-alpha
Name:Hypoxia-inducible factor 1-alpha
Type:PROTEIN
Mol. Mass.:93492.99
Organism:Mus musculus
Description:ChEMBL_576753
Residue:836
BDBM50414393
NameBDBM50414393
Synonyms:CHEMBL2021443
TypeSmall organic molecule
Emp. Form.C41H50O11
Mol. Mass.718.8291
SMILESCOc1ccc(cc1OC)[C@@H](O)[C@@H](C)Oc1ccc(cc1O)[C@@H]1O[C@H]([C@H](C)[C@H]1C)c1ccc(O[C@H](C)[C@H](O)c2ccc(OC)c(OC)c2)c(OC)c1