Reaction Details
TargetPeroxisome proliferator-activated receptor gamma
LigandBDBM50295043
Substrate/Competitorn/a
Meas. Tech.ChEMBL_573966 (CHEMBL1062956)
IC50 39±n/a nM
Citation Gorczynski, MJSmitherman, PKAkiyama, TEWood, HBBerger, JPKing, SBMorrow, CS Activation of peroxisome proliferator-activated receptor gamma (PPARgamma) by nitroalkene fatty acids: importance of nitration position and degree of unsaturation. J Med Chem52:4631-9 (2009) 
 
Peroxisome proliferator-activated receptor gamma
Name:Peroxisome proliferator-activated receptor gamma
Type:Nuclear Receptor
Mol. Mass.:57613.46
Organism:Homo sapiens (Human)
Description:P37231
Residue:505
BDBM50295043
NameBDBM50295043
Synonyms:(E)-12-Nitrooctadec-12-enoic Acid | CHEMBL549351
TypeSmall organic molecule
Emp. Form.C18H33NO4
Mol. Mass.327.4589
SMILESCCCCC\C=C(/CCCCCCCCCCC(O)=O)[N+]([O-])=O