Reaction Details
TargetSodium-dependent serotonin transporter
LigandBDBM50295056
Substrate/Competitorn/a
Meas. Tech.ChEMBL_574190 (CHEMBL1060391)
Ki 7.4±n/a nM
Citation Zhou, DStack, GPLo, JFailli, AAEvrard, DAHarrison, BLHatzenbuhler, NTTran, MCroce, SYi, SGolembieski, JHornby, GALai, MLin, QSchechter, LESmith, DLShilling, ADHuselton, CMitchell, PBeyer, CEAndree, TH Synthesis, potency, and in vivo evaluation of 2-piperazin-1-ylquinoline analogues as dual serotonin reuptake inhibitors and serotonin 5-HT1A receptor antagonists. J Med Chem52:4955-9 (2009) 
 
Sodium-dependent serotonin transporter
Name:Sodium-dependent serotonin transporter
Type:Multi-pass membrane protein
Mol. Mass.:70168.43
Organism:Rattus norvegicus (rat)
Description:P31652
Residue:630
BDBM50295056
NameBDBM50295056
Synonyms:(2S)-8-Methyl-2-[(4-quinolin-2-yl-1,4-diazepan-1-yl)methyl]-2,3-dihydro[1,4]dioxino[2,3-f]-quinoline | CHEMBL551304
TypeSmall organic molecule
Emp. Form.C27H28N4O2
Mol. Mass.440.5368
SMILESCc1ccc2c3O[C@@H](CN4CCCN(CC4)c4ccc5ccccc5n4)COc3ccc2n1