Reaction Details
TargetSodium-dependent serotonin transporter
LigandBDBM50295052
Substrate/Competitorn/a
Meas. Tech.ChEMBL_574190 (CHEMBL1060391)
Ki 13.8±n/a nM
Citation Zhou, DStack, GPLo, JFailli, AAEvrard, DAHarrison, BLHatzenbuhler, NTTran, MCroce, SYi, SGolembieski, JHornby, GALai, MLin, QSchechter, LESmith, DLShilling, ADHuselton, CMitchell, PBeyer, CEAndree, TH Synthesis, potency, and in vivo evaluation of 2-piperazin-1-ylquinoline analogues as dual serotonin reuptake inhibitors and serotonin 5-HT1A receptor antagonists. J Med Chem52:4955-9 (2009) 
 
Sodium-dependent serotonin transporter
Name:Sodium-dependent serotonin transporter
Type:Multi-pass membrane protein
Mol. Mass.:70168.43
Organism:Rattus norvegicus (rat)
Description:P31652
Residue:630
BDBM50295052
NameBDBM50295052
Synonyms:2-(4-{[(2S)-8-Methyl-2,3-dihydro[1,4]dioxino[2,3-f]quinolin-2-yl]methyl}piperazin-1-yl)-quinoline-6-carbonitrile | CHEMBL551964
TypeSmall organic molecule
Emp. Form.C27H25N5O2
Mol. Mass.451.5197
SMILESCc1ccc2c3O[C@@H](CN4CCN(CC4)c4ccc5cc(ccc5n4)C#N)COc3ccc2n1