Reaction Details
TargetPoly [ADP-ribose] polymerase 1
LigandBDBM50295217
Substrate/Competitorn/a
Meas. Tech.ChEMBL_577412 (CHEMBL1056264)
IC50 30±n/a nM
Citation Orvieto, FBranca, DGiomini, CJones, PKoch, UOntoria, JMPalumbi, MCRowley, MToniatti, CMuraglia, E Identification of substituted pyrazolo[1,5-a]quinazolin-5(4H)-one as potent poly(ADP-ribose)polymerase-1 (PARP-1) inhibitors. Bioorg Med Chem Lett19:4196-200 (2009) 
 
Poly [ADP-ribose] polymerase 1
Name:Poly [ADP-ribose] polymerase 1
Type:n/a
Mol. Mass.:113114.22
Organism:Homo sapiens (Human)
Description:P09874
Residue:1014
BDBM50295217
NameBDBM50295217
Synonyms:2-(3,4,5-trimethoxyphenyl)pyrazolo[1,5-a]quinazolin-5(4H)-one | CHEMBL562117
TypeSmall organic molecule
Emp. Form.C19H17N3O4
Mol. Mass.351.356
SMILESCOc1cc(cc(OC)c1OC)-c1cc2[nH]c(=O)c3ccccc3n2n1