Reaction Details
TargetHistamine H4 receptor
LigandBDBM50246289
Substrate/Competitorn/a
Meas. Tech.ChEMBL_577508 (CHEMBL1057860)
IC50>10000±n/a nM
Citation Mitobe, YIto, SMizutani, TNagase, TSato, NTokita, S Development of a selective and potent radioactive ligand for histamine H(3) receptors: A compound potentially useful for receptor occupancy studies. Bioorg Med Chem Lett19:4075-8 (2009) 
 
Histamine H4 receptor
Name:Histamine H4 receptor
Type:G Protein-Coupled Receptor (GPCR)
Mol. Mass.:44517.02
Organism:Homo sapiens (Human)
Description:Binding assays were using CHO cells stably expressing hH4R receptors.
Residue:390
BDBM50246289
NameBDBM50246289
Synonyms:3-methyl-2-(4-(3-(pyrrolidin-1-yl)propoxy)phenyl)quinazolin-4(3H)-one CHEMBL557214
TypeSmall organic molecule
Emp. Form.C22H25N3O2
Mol. Mass.363.4528
SMILESCn1c(nc2ccccc2c1=O)-c1ccc(OCCCN2CCCC2)cc1