Reaction Details
TargetHistamine H3 receptor
LigandBDBM50246289
Substrate/Competitorn/a
Meas. Tech.ChEMBL_577510 (CHEMBL1057862)
Ki 2.4±n/a nM
Citation Mitobe, YIto, SMizutani, TNagase, TSato, NTokita, S Development of a selective and potent radioactive ligand for histamine H(3) receptors: A compound potentially useful for receptor occupancy studies. Bioorg Med Chem Lett19:4075-8 (2009) 
 
Histamine H3 receptor
Name:Histamine H3 receptor
Type:PROTEIN
Mol. Mass.:48560.37
Organism:Mus musculus
Description:ChEMBL_988451
Residue:445
BDBM50246289
NameBDBM50246289
Synonyms:3-methyl-2-(4-(3-(pyrrolidin-1-yl)propoxy)phenyl)quinazolin-4(3H)-one CHEMBL557214
TypeSmall organic molecule
Emp. Form.C22H25N3O2
Mol. Mass.363.4528
SMILESCn1c(nc2ccccc2c1=O)-c1ccc(OCCCN2CCCC2)cc1