Reaction Details
TargetHistamine H3 receptor
LigandBDBM7966
Substrate/Competitorn/a
Meas. Tech.ChEMBL_577510 (CHEMBL1057862)
Ki 68±n/a nM
Citation Mitobe, YIto, SMizutani, TNagase, TSato, NTokita, S Development of a selective and potent radioactive ligand for histamine H(3) receptors: A compound potentially useful for receptor occupancy studies. Bioorg Med Chem Lett19:4075-8 (2009) 
 
Histamine H3 receptor
Name:Histamine H3 receptor
Type:PROTEIN
Mol. Mass.:48560.37
Organism:Mus musculus
Description:ChEMBL_988451
Residue:445
BDBM7966
NameBDBM7966
Synonyms:2-(1H-imidazol-4-yl)ethan-1-amine CHEMBL90 Ergotidine Histamine Peremin | [3H]histamine
TypeSmall organic molecule
Emp. Form.C5H9N3
Mol. Mass.111.1451
SMILESNCCc1cnc[nH]1