Reaction Details
TargetNeuromedin-B receptor
LigandBDBM50295222
Substrate/Competitorn/a
Meas. Tech.ChEMBL_577514 (CHEMBL1057866)
IC50 150±n/a nM
Citation Fu, JShuttleworth, SJConnors, RVChai, ACoward, P Discovery and optimization of a novel Neuromedin B receptor antagonist. Bioorg Med Chem Lett19:4264-7 (2009) 
 
Neuromedin-B receptor
Name:Neuromedin-B receptor
Type:Enzyme Catalytic Domain
Mol. Mass.:43447.11
Organism:Homo sapiens (Human)
Description:Bombesin 1 NMBR 0::P28336
Residue:390
BDBM50295222
NameBDBM50295222
Synonyms:10-butyl-11-(2-chloro-6-fluorophenyl)-3,3,8-trimethyl-2,3,4,5,10,11-hexahydro-1H-dibenzo[b,e][1,4]diazepin-1-one | CHEMBL559860
TypeSmall organic molecule
Emp. Form.C26H30ClFN2O
Mol. Mass.440.981
SMILESCCCCN1C(C2C(=O)CC(C)(C)CC2=Nc2ccc(C)cc12)c1c(F)cccc1Cl