Reaction Details
TargetNeuromedin-B receptor
LigandBDBM50295225
Substrate/Competitorn/a
Meas. Tech.ChEMBL_577514 (CHEMBL1057866)
IC50 810±n/a nM
Citation Fu, JShuttleworth, SJConnors, RVChai, ACoward, P Discovery and optimization of a novel Neuromedin B receptor antagonist. Bioorg Med Chem Lett19:4264-7 (2009) 
 
Neuromedin-B receptor
Name:Neuromedin-B receptor
Type:Enzyme Catalytic Domain
Mol. Mass.:43447.11
Organism:Homo sapiens (Human)
Description:Bombesin 1 NMBR 0::P28336
Residue:390
BDBM50295225
NameBDBM50295225
Synonyms:11-(2-chloro-6-fluorophenyl)-3-isopropyl-8-methyl-2,3,4,5,10,11-hexahydro-1H-dibenzo[b,e][1,4]diazepin-1-one | CHEMBL563752
TypeSmall organic molecule
Emp. Form.C23H24ClFN2O
Mol. Mass.398.901
SMILESCC(C)C1CC(=O)C2C(Nc3cc(C)ccc3N=C2C1)c1c(F)cccc1Cl