Reaction Details
TargetNeuromedin-B receptor
LigandBDBM50295231
Substrate/Competitorn/a
Meas. Tech.ChEMBL_577520 (CHEMBL1057872)
IC50 580±n/a nM
Citation Fu, JShuttleworth, SJConnors, RVChai, ACoward, P Discovery and optimization of a novel Neuromedin B receptor antagonist. Bioorg Med Chem Lett19:4264-7 (2009) 
 
Neuromedin-B receptor
Name:Neuromedin-B receptor
Type:Enzyme Catalytic Domain
Mol. Mass.:43447.11
Organism:Homo sapiens (Human)
Description:Bombesin 1 NMBR 0::P28336
Residue:390
BDBM50295231
NameBDBM50295231
Synonyms:(+)-8'-methyl-11'-(2-(trifluoromethyl)phenyl)-4',5',10',11'-tetrahydrospiro[cyclopentane-1,3'-dibenzo[b,e][1,4]diazepin]-1'(2'H)-one 8'-methyl-11'-(2-(trifluoromethyl)phenyl)-4',5',10',11'-tetrahydrospiro[cyclopentane-1,3'-dibenzo[b,e][1,4]diazepin]-1'(2'H)-one | CHEMBL563374
TypeSmall organic molecule
Emp. Form.C25H25F3N2O
Mol. Mass.426.474
SMILESCc1ccc2N=C3CC4(CCCC4)CC(=O)C3C(Nc2c1)c1ccccc1C(F)(F)F