Reaction Details
TargetNeuromedin-B receptor
LigandBDBM50295237
Substrate/Competitorn/a
Meas. Tech.ChEMBL_577514 (CHEMBL1057866)
IC50 370±n/a nM
Citation Fu, JShuttleworth, SJConnors, RVChai, ACoward, P Discovery and optimization of a novel Neuromedin B receptor antagonist. Bioorg Med Chem Lett19:4264-7 (2009) 
 
Neuromedin-B receptor
Name:Neuromedin-B receptor
Type:Enzyme Catalytic Domain
Mol. Mass.:43447.11
Organism:Homo sapiens (Human)
Description:Bombesin 1 NMBR 0::P28336
Residue:390
BDBM50295237
NameBDBM50295237
Synonyms:11-(2-chloro-6-fluorophenyl)-3,3-dimethyl-8-(trifluoromethyl)-2,3,4,5,10,11-hexahydro-1H-dibenzo[b,e][1,4]diazepin-1-one | CHEMBL564278
TypeSmall organic molecule
Emp. Form.C22H19ClF4N2O
Mol. Mass.438.846
SMILESCC1(C)CC(=O)C2C(Nc3cc(ccc3N=C2C1)C(F)(F)F)c1c(F)cccc1Cl