Reaction Details
TargetDNA topoisomerase 2-alpha
LigandBDBM50295259
Substrate/Competitorn/a
Meas. Tech.ChEMBL_577728 (CHEMBL1063988)
IC50 8400±n/a nM
Citation Furet, PSchoepfer, JRadimerski, TChène, P Discovery of a new class of catalytic topoisomerase II inhibitors targeting the ATP-binding site by structure based design. Part I. Bioorg Med Chem Lett19:4014-7 (2009) 
 
DNA topoisomerase 2-alpha
Name:DNA topoisomerase 2-alpha
Type:Protein
Mol. Mass.:174415.30
Organism:Homo sapiens (Human)
Description:P11388
Residue:1531
BDBM50295259
NameBDBM50295259
Synonyms:CHEMBL549357 | N2-(benzo[d]thiazol-6-yl)-N6-cycloheptyl-9H-purine-2,6-diamine
TypeSmall organic molecule
Emp. Form.C19H21N7S
Mol. Mass.379.482
SMILESC1CCCC(CC1)Nc1nc(Nc2ccc3ncsc3c2)nc2nc[nH]c12