Reaction Details
TargetNeuraminidase
LigandBDBM50295343
Substrate/Competitorn/a
Meas. Tech.ChEMBL_578382 (CHEMBL1057938)
IC50 1250000±n/a nM
Citation Sakamoto, JKoyama, TMiyamoto, DYingsakmongkon, SHidari, KIJampangern, WSuzuki, TSuzuki, YEsumi, YNakamura, THatano, KTerunuma, DMatsuoka, K Systematic syntheses of influenza neuraminidase inhibitors: a series of carbosilane dendrimers uniformly functionalized with thioglycoside-type sialic acid moieties. Bioorg Med Chem17:5451-64 (2009) 
 
Neuraminidase
Name:Neuraminidase
Type:PROTEIN
Mol. Mass.:52105.18
Organism:Influenza A virus (strain A/Memphis/1/1971 H3N2)
Description:ChEMBL_578382
Residue:469
BDBM50295343
NameBDBM50295343
Synonyms:(R,R,2S,2'S,4S,4'S,5R,5'R,6R,6'R)-2,2'-(14-(21-((2S,4S,5R,6R)-5-acetamido-2-carboxy-4-hydroxy-6-((1R,2R)-1,2,3-trihydroxypropyl)tetrahydro-2H-pyran-2-ylthio)-8,8-bis(3-(3-(5-((2S,4S,5R,6R)-5-acetamido-2-carboxy-4-hydroxy-6-((1R,2R)-1,2,3-trihydroxypropyl)tetrahydro-2H-pyran-2-ylthio)pentylthio)propoxy)propyl)-4,4-dimethyl-12-oxa-16-thia-4,8-disilahenicosyl)-14-(3-(3-(5-((2S,4S,5R,6R)-5-acetamido-2-carboxy-4-hydroxy-6-((1R,2R)-1,2,3-trihydroxypropyl)tetrahydro-2H-pyran-2-ylthio)pentylthio)pr | CHEMBL553110
TypeSmall organic molecule
Emp. Form.C140H258N6O54S12Si3
Mol. Mass.3358.591
SMILESCC(=O)N[C@@H]1[C@@H](O)C[C@](O[C@H]1[C@H](O)[C@H](O)CO)(SCCCCCSCCCOCCC[Si](CCCOCCCSCCCCCS[C@@]1(C[C@H](O)[C@@H](NC(C)=O)[C@@H](O1)[C@H](O)[C@H](O)CO)C(O)=O)(CCCOCCCSCCCCCS[C@@]1(C[C@H](O)[C@@H](NC(C)=O)[C@@H](O1)[C@H](O)[C@H](O)CO)C(O)=O)CCC[Si](C)(C)CCC[Si](CCCOCCCSCCCCCS[C@@]1(C[C@H](O)[C@@H](NC(C)=O)[C@@H](O1)[C@H](O)[C@H](O)CO)C(O)=O)(CCCOCCCSCCCCCS[C@@]1(C[C@H](O)[C@@H](NC(C)=O)[C@@H](O1)[C@H](O)[C@H](O)CO)C(O)=O)CCCOCCCSCCCCCS[C@@]1(C[C@H](O)[C@@H](NC(C)=O)[C@@H](O1)[C@H](O)[C@H](O)CO)C(O)=O)C(O)=O