Reaction Details
TargetNeuraminidase
LigandBDBM50295346
Substrate/Competitorn/a
Meas. Tech.ChEMBL_578382 (CHEMBL1057938)
IC50 7100000±n/a nM
Citation Sakamoto, JKoyama, TMiyamoto, DYingsakmongkon, SHidari, KIJampangern, WSuzuki, TSuzuki, YEsumi, YNakamura, THatano, KTerunuma, DMatsuoka, K Systematic syntheses of influenza neuraminidase inhibitors: a series of carbosilane dendrimers uniformly functionalized with thioglycoside-type sialic acid moieties. Bioorg Med Chem17:5451-64 (2009) 
 
Neuraminidase
Name:Neuraminidase
Type:PROTEIN
Mol. Mass.:52105.18
Organism:Influenza A virus (strain A/Memphis/1/1971 H3N2)
Description:ChEMBL_578382
Residue:469
BDBM50295346
NameBDBM50295346
Synonyms:(R,R,2S,2'S,4S,4'S,5R,5'R,6R,6'R)-2,2'-(17-(3-(6-(5-((2S,4S,5R,6R)-5-acetamido-2-carboxy-4-hydroxy-6-((1R,2R)-1,2,3-trihydroxypropyl)tetrahydro-2H-pyran-2-ylthio)pentylthio)hexanamido)propyl)-12,22-dioxo-17-phenyl-6,28-dithia-13,21-diaza-17-silatritriacontane-1,33-diyl)bis(sulfanediyl)bis(5-acetamido-4-hydroxy-6-((1R,2R)-1,2,3-trihydroxypropyl)tetrahydro-2H-pyran-2-carboxylic acid) | CHEMBL552651
TypeSmall organic molecule
Emp. Form.C81H140N6O27S6Si
Mol. Mass.1850.478
SMILESCC(=O)N[C@@H]1[C@@H](O)C[C@](O[C@H]1[C@H](O)[C@H](O)CO)(SCCCCCSCCCCCC(=O)NCCC[Si](CCCNC(=O)CCCCCSCCCCCS[C@@]1(C[C@H](O)[C@@H](NC(C)=O)[C@@H](O1)[C@H](O)[C@H](O)CO)C(O)=O)(CCCNC(=O)CCCCCSCCCCCS[C@@]1(C[C@H](O)[C@@H](NC(C)=O)[C@@H](O1)[C@H](O)[C@H](O)CO)C(O)=O)c1ccccc1)C(O)=O