Reaction Details
TargetFatty acid-binding protein, liver
LigandBDBM28700
Substrate/Competitorn/a
Meas. Tech.ChEMBL_578560 (CHEMBL1052402)
Kd 19000±n/a nM
Citation Chuang, SVelkov, THorne, JWielens, JChalmers, DKPorter, CJScanlon, MJ Probing the fibrate binding specificity of rat liver fatty acid binding protein. J Med Chem52:5344-55 (2009) 
 
Fatty acid-binding protein, liver
Name:Fatty acid-binding protein, liver
Type:Protein
Mol. Mass.:14274.39
Organism:Rattus norvegicus (Rat)
Description:rat L-FABP
Residue:127
BDBM28700
NameBDBM28700
Synonyms:2-(4-(4-Chlorobenzoyl)phenoxy)-2-methylpropionic acid CHEMBL981 FIBRICOR LF 153 procetofenic acid
TypeSmall organic molecule
Emp. Form.C17H15ClO4
Mol. Mass.318.752
SMILESCC(C)(Oc1ccc(cc1)C(=O)c1ccc(Cl)cc1)C(O)=O