Reaction Details
TargetMultidrug resistance-associated protein 1
LigandBDBM50295478
Substrate/Competitorn/a
Meas. Tech.ChEMBL_579082 (CHEMBL1062284)
Ki 200±n/a nM
Citation Wong, ILChan, KFTsang, KHLam, CYZhao, YChan, THChow, LM Modulation of multidrug resistance protein 1 (MRP1/ABCC1)-mediated multidrug resistance by bivalent apigenin homodimers and their derivatives. J Med Chem52:5311-22 (2009) 
 
Multidrug resistance-associated protein 1
Name:Multidrug resistance-associated protein 1
Type:n/a
Mol. Mass.:171597.72
Organism:Homo sapiens (Human)
Description:P33527
Residue:1531
BDBM50295478
NameBDBM50295478
Synonyms:1,16-Bis[40-((6-methyl)-4H-chromen-4-on-2-yl)phenyl]-1,4,7,10,13,16-hexaoxahexadecane | CHEMBL539987
TypeSmall organic molecule
Emp. Form.C42H42O10
Mol. Mass.706.7769
SMILESCc1ccc2oc(cc(=O)c2c1)-c1ccc(OCCOCCOCCOCCOCCOc2ccc(cc2)-c2cc(=O)c3cc(C)ccc3o2)cc1