Reaction Details
TargetMacrophage metalloelastase
LigandBDBM28485
Substrate/Competitorn/a
Meas. Tech.ChEMBL_579099 (CHEMBL1062301)
IC50 14±n/a nM
Citation Li, WLi, JWu, YRancati, FVallese, SRaveglia, LWu, JHotchandani, RFuller, NCunningham, KMorgan, PFish, SKrykbaev, RXu, XTam, SGoldman, SJAbraham, WWilliams, CSypek, JMansour, TS Identification of an orally efficacious matrix metalloprotease 12 inhibitor for potential treatment of asthma. J Med Chem52:5408-19 (2009) 
 
Macrophage metalloelastase
Name:Macrophage metalloelastase
Type:Enzyme
Mol. Mass.:54012.99
Organism:Homo sapiens (Human)
Description:P39900
Residue:470
BDBM28485
NameBDBM28485
Synonyms:(2S)-2-({4-[4-(1-benzofuran-2-amido)phenyl]benzene}sulfonamido)-3-methylbutanoic acid benzofuran, 1
TypeSmall organic molecule
Emp. Form.C26H24N2O6S
Mol. Mass.492.544
SMILESCC(C)[C@H](NS(=O)(=O)c1ccc(cc1)-c1ccc(NC(=O)c2cc3ccccc3o2)cc1)C(O)=O