Reaction Details
TargetMacrophage metalloelastase
LigandBDBM50295483
Substrate/Competitorn/a
Meas. Tech.ChEMBL_579099 (CHEMBL1062301)
IC50 2100±n/a nM
Citation Li, WLi, JWu, YRancati, FVallese, SRaveglia, LWu, JHotchandani, RFuller, NCunningham, KMorgan, PFish, SKrykbaev, RXu, XTam, SGoldman, SJAbraham, WWilliams, CSypek, JMansour, TS Identification of an orally efficacious matrix metalloprotease 12 inhibitor for potential treatment of asthma. J Med Chem52:5408-19 (2009) 
 
Macrophage metalloelastase
Name:Macrophage metalloelastase
Type:Enzyme
Mol. Mass.:54012.99
Organism:Homo sapiens (Human)
Description:P39900
Residue:470
BDBM50295483
NameBDBM50295483
Synonyms:(S)-3-Methyl-2-(7-(methylsulfonamido)dibenzo[b,d]thiophene-2-sulfonamido)butanoic Acid | CHEMBL552377
TypeSmall organic molecule
Emp. Form.C18H20N2O6S3
Mol. Mass.456.556
SMILESCC(C)[C@H](NS(=O)(=O)c1ccc2sc3cc(NS(C)(=O)=O)ccc3c2c1)C(O)=O