Reaction Details
TargetMacrophage metalloelastase
LigandBDBM50295489
Substrate/Competitorn/a
Meas. Tech.ChEMBL_579099 (CHEMBL1062301)
IC50 0.400000±n/a nM
Citation Li, WLi, JWu, YRancati, FVallese, SRaveglia, LWu, JHotchandani, RFuller, NCunningham, KMorgan, PFish, SKrykbaev, RXu, XTam, SGoldman, SJAbraham, WWilliams, CSypek, JMansour, TS Identification of an orally efficacious matrix metalloprotease 12 inhibitor for potential treatment of asthma. J Med Chem52:5408-19 (2009) 
 
Macrophage metalloelastase
Name:Macrophage metalloelastase
Type:Enzyme
Mol. Mass.:54012.99
Organism:Homo sapiens (Human)
Description:P39900
Residue:470
BDBM50295489
NameBDBM50295489
Synonyms:(S)-2-(8-(Methoxycarbonylamino)dibenzo[b,d]thiophene-3-sulfonamido)-3-methylbutanoic Acid | CHEMBL561312
TypeSmall organic molecule
Emp. Form.C19H20N2O6S2
Mol. Mass.436.502
SMILESCOC(=O)Nc1ccc2sc3cc(ccc3c2c1)S(=O)(=O)N[C@@H](C(C)C)C(O)=O