Reaction Details
TargetMacrophage metalloelastase
LigandBDBM50295493
Substrate/Competitorn/a
Meas. Tech.ChEMBL_579099 (CHEMBL1062301)
IC50 42±n/a nM
Citation Li, WLi, JWu, YRancati, FVallese, SRaveglia, LWu, JHotchandani, RFuller, NCunningham, KMorgan, PFish, SKrykbaev, RXu, XTam, SGoldman, SJAbraham, WWilliams, CSypek, JMansour, TS Identification of an orally efficacious matrix metalloprotease 12 inhibitor for potential treatment of asthma. J Med Chem52:5408-19 (2009) 
 
Macrophage metalloelastase
Name:Macrophage metalloelastase
Type:Enzyme
Mol. Mass.:54012.99
Organism:Homo sapiens (Human)
Description:P39900
Residue:470
BDBM50295493
NameBDBM50295493
Synonyms:(S)-2-(7-Aminodibenzo[b,d]thiophene-3-sulfonamido)-3-methylbutanoic Acid | CHEMBL550702
TypeSmall organic molecule
Emp. Form.C17H18N2O4S2
Mol. Mass.378.466
SMILESCC(C)[C@H](NS(=O)(=O)c1ccc2c(c1)sc1cc(N)ccc21)C(O)=O