Reaction Details
TargetMacrophage metalloelastase
LigandBDBM50295502
Substrate/Competitorn/a
Meas. Tech.ChEMBL_579099 (CHEMBL1062301)
IC50 28±n/a nM
Citation Li, WLi, JWu, YRancati, FVallese, SRaveglia, LWu, JHotchandani, RFuller, NCunningham, KMorgan, PFish, SKrykbaev, RXu, XTam, SGoldman, SJAbraham, WWilliams, CSypek, JMansour, TS Identification of an orally efficacious matrix metalloprotease 12 inhibitor for potential treatment of asthma. J Med Chem52:5408-19 (2009) 
 
Macrophage metalloelastase
Name:Macrophage metalloelastase
Type:Enzyme
Mol. Mass.:54012.99
Organism:Homo sapiens (Human)
Description:P39900
Residue:470
BDBM50295502
NameBDBM50295502
Synonyms:(S)-2-(7-((4-Fluorophenoxy)carbonylamino)dibenzo[b,d]thiophene-3-sulfonamido)-3-methylbutanoic Acid | CHEMBL562114
TypeSmall organic molecule
Emp. Form.C24H21FN2O6S2
Mol. Mass.516.562
SMILESCC(C)[C@H](NS(=O)(=O)c1ccc2c(c1)sc1cc(NC(=O)Oc3ccc(F)cc3)ccc21)C(O)=O