Reaction Details
TargetCollagenase 3
LigandBDBM28486
Substrate/Competitorn/a
Meas. Tech.ChEMBL_579100 (CHEMBL1062302)
IC50 2500±n/a nM
Citation Li, WLi, JWu, YRancati, FVallese, SRaveglia, LWu, JHotchandani, RFuller, NCunningham, KMorgan, PFish, SKrykbaev, RXu, XTam, SGoldman, SJAbraham, WWilliams, CSypek, JMansour, TS Identification of an orally efficacious matrix metalloprotease 12 inhibitor for potential treatment of asthma. J Med Chem52:5408-19 (2009) 
 
Collagenase 3
Name:Collagenase 3
Type:Enzyme
Mol. Mass.:53808.06
Organism:Homo sapiens (Human)
Description:P45452
Residue:471
BDBM28486
NameBDBM28486
Synonyms:(2R)-3-methyl-2-{8-oxatricyclo[7.4.0.0^{2,7}]trideca-1(13),2,4,6,9,11-hexaene-4-sulfonamido}butanoic acid | dibenzofuran (DBF) scaffold, (R)-2a
TypeSmall organic molecule
Emp. Form.C17H17NO5S
Mol. Mass.347.386
SMILESCC(C)[C@@H](NS(=O)(=O)c1ccc2oc3ccccc3c2c1)C(O)=O