Reaction Details
TargetCollagenase 3
LigandBDBM50295485
Substrate/Competitorn/a
Meas. Tech.ChEMBL_579100 (CHEMBL1062302)
IC50 1135±n/a nM
Citation Li, WLi, JWu, YRancati, FVallese, SRaveglia, LWu, JHotchandani, RFuller, NCunningham, KMorgan, PFish, SKrykbaev, RXu, XTam, SGoldman, SJAbraham, WWilliams, CSypek, JMansour, TS Identification of an orally efficacious matrix metalloprotease 12 inhibitor for potential treatment of asthma. J Med Chem52:5408-19 (2009) 
 
Collagenase 3
Name:Collagenase 3
Type:Enzyme
Mol. Mass.:53808.06
Organism:Homo sapiens (Human)
Description:P45452
Residue:471
BDBM50295485
NameBDBM50295485
Synonyms:(S)-3-Methyl-2-(8-(methylsulfonamido)dibenzo[b,d]thiophene-3-sulfonamido)butanoic Acid | CHEMBL551655
TypeSmall organic molecule
Emp. Form.C18H20N2O6S3
Mol. Mass.456.556
SMILESCC(C)[C@H](NS(=O)(=O)c1ccc2c(c1)sc1ccc(NS(C)(=O)=O)cc21)C(O)=O