Reaction Details
TargetCollagenase 3
LigandBDBM28482
Substrate/Competitorn/a
Meas. Tech.ChEMBL_579100 (CHEMBL1062302)
IC50 505±n/a nM
Citation Li, WLi, JWu, YRancati, FVallese, SRaveglia, LWu, JHotchandani, RFuller, NCunningham, KMorgan, PFish, SKrykbaev, RXu, XTam, SGoldman, SJAbraham, WWilliams, CSypek, JMansour, TS Identification of an orally efficacious matrix metalloprotease 12 inhibitor for potential treatment of asthma. J Med Chem52:5408-19 (2009) 
 
Collagenase 3
Name:Collagenase 3
Type:Enzyme
Mol. Mass.:53808.06
Organism:Homo sapiens (Human)
Description:P45452
Residue:471
BDBM28482
NameBDBM28482
Synonyms:(2S)-2-({11-[(methoxycarbonyl)amino]-8-oxatricyclo[7.4.0.0^{2,7}]trideca-1(9),2(7),3,5,10,12-hexaene-5-}sulfonamido)-3-methylbutanoic acid | dibenzofuran (DBF) scaffold, (S)-27
TypeSmall organic molecule
Emp. Form.C19H20N2O7S
Mol. Mass.420.436
SMILESCOC(=O)Nc1ccc2c(c1)oc1cc(ccc21)S(=O)(=O)N[C@@H](C(C)C)C(O)=O