Reaction Details
TargetCollagenase 3
LigandBDBM50295495
Substrate/Competitorn/a
Meas. Tech.ChEMBL_579100 (CHEMBL1062302)
IC50 56±n/a nM
Citation Li, WLi, JWu, YRancati, FVallese, SRaveglia, LWu, JHotchandani, RFuller, NCunningham, KMorgan, PFish, SKrykbaev, RXu, XTam, SGoldman, SJAbraham, WWilliams, CSypek, JMansour, TS Identification of an orally efficacious matrix metalloprotease 12 inhibitor for potential treatment of asthma. J Med Chem52:5408-19 (2009) 
 
Collagenase 3
Name:Collagenase 3
Type:Enzyme
Mol. Mass.:53808.06
Organism:Homo sapiens (Human)
Description:P45452
Residue:471
BDBM50295495
NameBDBM50295495
Synonyms:(S)-2-(7-(Ethoxycarbonylamino)dibenzo[b,d]thiophene-3-sulfonamido)-3-methylbutanoic Acid | CHEMBL561715
TypeSmall organic molecule
Emp. Form.C20H22N2O6S2
Mol. Mass.450.528
SMILESCCOC(=O)Nc1ccc2c(c1)sc1cc(ccc21)S(=O)(=O)N[C@@H](C(C)C)C(O)=O