Reaction Details
TargetCollagenase 3
LigandBDBM50295497
Substrate/Competitorn/a
Meas. Tech.ChEMBL_579100 (CHEMBL1062302)
IC50 334±n/a nM
Citation Li, WLi, JWu, YRancati, FVallese, SRaveglia, LWu, JHotchandani, RFuller, NCunningham, KMorgan, PFish, SKrykbaev, RXu, XTam, SGoldman, SJAbraham, WWilliams, CSypek, JMansour, TS Identification of an orally efficacious matrix metalloprotease 12 inhibitor for potential treatment of asthma. J Med Chem52:5408-19 (2009) 
 
Collagenase 3
Name:Collagenase 3
Type:Enzyme
Mol. Mass.:53808.06
Organism:Homo sapiens (Human)
Description:P45452
Residue:471
BDBM50295497
NameBDBM50295497
Synonyms:(S)-2-(7-(Isobutoxycarbonylamino)dibenzo[b,d]thiophene-3-sulfonamido)-3-methylbutanoic Acid | CHEMBL550907
TypeSmall organic molecule
Emp. Form.C22H26N2O6S2
Mol. Mass.478.582
SMILESCC(C)COC(=O)Nc1ccc2c(c1)sc1cc(ccc21)S(=O)(=O)N[C@@H](C(C)C)C(O)=O