Reaction Details
TargetCollagenase 3
LigandBDBM50295499
Substrate/Competitorn/a
Meas. Tech.ChEMBL_579100 (CHEMBL1062302)
IC50 23±n/a nM
Citation Li, WLi, JWu, YRancati, FVallese, SRaveglia, LWu, JHotchandani, RFuller, NCunningham, KMorgan, PFish, SKrykbaev, RXu, XTam, SGoldman, SJAbraham, WWilliams, CSypek, JMansour, TS Identification of an orally efficacious matrix metalloprotease 12 inhibitor for potential treatment of asthma. J Med Chem52:5408-19 (2009) 
 
Collagenase 3
Name:Collagenase 3
Type:Enzyme
Mol. Mass.:53808.06
Organism:Homo sapiens (Human)
Description:P45452
Residue:471
BDBM50295499
NameBDBM50295499
Synonyms:(S)-2-(7-((But-3-ynyloxy)carbonylamino)dibenzo[b,d]thiophene-3-sulfonamido)-3-methylbutanoic Acid | CHEMBL563407
TypeSmall organic molecule
Emp. Form.C22H22N2O6S2
Mol. Mass.474.55
SMILESCC(C)[C@H](NS(=O)(=O)c1ccc2c(c1)sc1cc(NC(=O)OCCC#C)ccc21)C(O)=O