Reaction Details
TargetCollagenase 3
LigandBDBM50295479
Substrate/Competitorn/a
Meas. Tech.ChEMBL_579100 (CHEMBL1062302)
IC50 106±n/a nM
Citation Li, WLi, JWu, YRancati, FVallese, SRaveglia, LWu, JHotchandani, RFuller, NCunningham, KMorgan, PFish, SKrykbaev, RXu, XTam, SGoldman, SJAbraham, WWilliams, CSypek, JMansour, TS Identification of an orally efficacious matrix metalloprotease 12 inhibitor for potential treatment of asthma. J Med Chem52:5408-19 (2009) 
 
Collagenase 3
Name:Collagenase 3
Type:Enzyme
Mol. Mass.:53808.06
Organism:Homo sapiens (Human)
Description:P45452
Residue:471
BDBM50295479
NameBDBM50295479
Synonyms:(S)-3-Methyl-2-(8-(2-oxooxazolidin-3-yl)dibenzo[b,d]furan-3-sulfonamido)butanoic Acid | CHEMBL550038
TypeSmall organic molecule
Emp. Form.C20H20N2O7S
Mol. Mass.432.447
SMILESCC(C)[C@H](NS(=O)(=O)c1ccc2c(c1)oc1ccc(cc21)N1CCOC1=O)C(O)=O