Reaction Details
TargetCollagenase 3
LigandBDBM50295512
Substrate/Competitorn/a
Meas. Tech.ChEMBL_579100 (CHEMBL1062302)
IC50 1093±n/a nM
Citation Li, WLi, JWu, YRancati, FVallese, SRaveglia, LWu, JHotchandani, RFuller, NCunningham, KMorgan, PFish, SKrykbaev, RXu, XTam, SGoldman, SJAbraham, WWilliams, CSypek, JMansour, TS Identification of an orally efficacious matrix metalloprotease 12 inhibitor for potential treatment of asthma. J Med Chem52:5408-19 (2009) 
 
Collagenase 3
Name:Collagenase 3
Type:Enzyme
Mol. Mass.:53808.06
Organism:Homo sapiens (Human)
Description:P45452
Residue:471
BDBM50295512
NameBDBM50295512
Synonyms:(S)-2-(7-Aminodibenzo[b,d]furan-3-sulfonamido)-3-methylbutanoic Acid | CHEMBL553918
TypeSmall organic molecule
Emp. Form.C17H18N2O5S
Mol. Mass.362.4
SMILESCC(C)[C@H](NS(=O)(=O)c1ccc2c(c1)oc1cc(N)ccc21)C(O)=O