Reaction Details
TargetfMet-Leu-Phe receptor
LigandBDBM50295522
Substrate/Competitorn/a
Meas. Tech.ChEMBL_580004 (CHEMBL1051692)
EC50 10500±n/a nM
Citation Cilibrizzi, AQuinn, MTKirpotina, LNSchepetkin, IAHolderness, JYe, RDRabiet, MJBiancalani, CCesari, NGraziano, AVergelli, CPieretti, SDal Piaz, VGiovannoni, MP 6-methyl-2,4-disubstituted pyridazin-3(2H)-ones: a novel class of small-molecule agonists for formyl peptide receptors. J Med Chem52:5044-57 (2010) 
 
fMet-Leu-Phe receptor
Name:fMet-Leu-Phe receptor
Type:Enzyme Catalytic Domain
Mol. Mass.:38456.14
Organism:Homo sapiens (Human)
Description:gi_4503779
Residue:350
BDBM50295522
NameBDBM50295522
Synonyms:2-[5-(3-Methoxybenzyl)-3-methyl-6-oxo-6H-pyridazin-1-yl]-N-(4-nitrophenyl)-acetamide | CHEMBL562456
TypeSmall organic molecule
Emp. Form.C21H20N4O5
Mol. Mass.408.4073
SMILESCOc1cccc(Cc2cc(C)nn(CC(=O)Nc3ccc(cc3)[N+]([O-])=O)c2=O)c1