Reaction Details
TargetN-formyl peptide receptor 2
LigandBDBM50295514
Substrate/Competitorn/a
Meas. Tech.ChEMBL_580002 (CHEMBL1051690)
EC50 4000±n/a nM
Citation Cilibrizzi, AQuinn, MTKirpotina, LNSchepetkin, IAHolderness, JYe, RDRabiet, MJBiancalani, CCesari, NGraziano, AVergelli, CPieretti, SDal Piaz, VGiovannoni, MP 6-methyl-2,4-disubstituted pyridazin-3(2H)-ones: a novel class of small-molecule agonists for formyl peptide receptors. J Med Chem52:5044-57 (2010) 
 
N-formyl peptide receptor 2
Name:N-formyl peptide receptor 2
Type:G Protein-Coupled Receptor (GPCR)
Mol. Mass.:38968.35
Organism:Homo sapiens (Human)
Description:P25090
Residue:351
BDBM50295514
NameBDBM50295514
Synonyms:CHEMBL556625 | N-(4-Chlorophenyl)-2-[5-(3-methoxybenzyl)-3-methyl-6-oxo-6H-pyridazin-1-yl]-acetamide
TypeSmall organic molecule
Emp. Form.C21H20ClN3O3
Mol. Mass.397.855
SMILESCOc1cccc(Cc2cc(C)nn(CC(=O)Nc3ccc(Cl)cc3)c2=O)c1