Reaction Details
TargetfMet-Leu-Phe receptor
LigandBDBM50295518
Substrate/Competitorn/a
Meas. Tech.ChEMBL_580006 (CHEMBL1051694)
EC50 1100±n/a nM
Citation Cilibrizzi, AQuinn, MTKirpotina, LNSchepetkin, IAHolderness, JYe, RDRabiet, MJBiancalani, CCesari, NGraziano, AVergelli, CPieretti, SDal Piaz, VGiovannoni, MP 6-methyl-2,4-disubstituted pyridazin-3(2H)-ones: a novel class of small-molecule agonists for formyl peptide receptors. J Med Chem52:5044-57 (2010) 
 
fMet-Leu-Phe receptor
Name:fMet-Leu-Phe receptor
Type:Enzyme Catalytic Domain
Mol. Mass.:38456.14
Organism:Homo sapiens (Human)
Description:gi_4503779
Residue:350
BDBM50295518
NameBDBM50295518
Synonyms:2-[5-(3-Methoxybenzyl)-3-methyl-6-oxo-6H-pyridazin-1-yl]-N-(4-methoxyphenyl)-acetamide | CHEMBL562910
TypeSmall organic molecule
Emp. Form.C22H23N3O4
Mol. Mass.393.4357
SMILESCOc1ccc(NC(=O)Cn2nc(C)cc(Cc3cccc(OC)c3)c2=O)cc1