Reaction Details
TargetCytochrome P450 3A4
LigandBDBM50295557
Substrate/Competitorn/a
Meas. Tech.ChEMBL_579908 (CHEMBL1063294)
IC50 2.999E3±n/a nM
Citation Roy, KPratim Roy, P Comparative chemometric modeling of cytochrome 3A4 inhibitory activity of structurally diverse compounds using stepwise MLR, FA-MLR, PLS, GFA, G/PLS and ANN techniques. Eur J Med Chem44:2913-22 (2009) 
 
Cytochrome P450 3A4
Name:Cytochrome P450 3A4
Type:Enzyme
Mol. Mass.:57349.57
Organism:Homo sapiens (Human)
Description:n/a
Residue:503
BDBM50295557
NameBDBM50295557
Synonyms:7-Methyl-4,6,6a,7,8,9,10,10a-octahydro-indolo[4,3-fg]quinoline-9-carboxylic acid ((2R,5S,10bS)-5-benzyl-10b-hydroxy-2-methyl-3,6-dioxo-octahydro-oxazolo[3,2-a]pyrrolo[2,1-c]pyrazin-2-yl)-amide CHEMBL1732 Dihydroer-gotamin
TypeSmall organic molecule
Emp. Form.C33H37N5O5
Mol. Mass.583.6774
SMILESCN1C[C@@H](C[C@H]2[C@H]1Cc1c[nH]c3cccc2c13)C(=O)N[C@]1(C)O[C@@]2(O)[C@@H]3CCCN3C(=O)[C@H](Cc3ccccc3)N2C1=O