Reaction Details
TargetHistone deacetylase 1
LigandBDBM50114835
Substrate/Competitorn/a
Meas. Tech.ChEMBL_579921 (CHEMBL1056354)
IC50 4±n/a nM
Citation Chen, YLi, HTang, WZhu, CJiang, YZou, JYu, QYou, Q 3D-QSAR studies of HDACs inhibitors using pharmacophore-based alignment. Eur J Med Chem44:2868-76 (2009) 
 
Histone deacetylase 1
Name:Histone deacetylase 1
Type:Enzyme
Mol. Mass.:55090.27
Organism:Homo sapiens (Human)
Description:Q13547
Residue:482
BDBM50114835
NameBDBM50114835
Synonyms:(E)-8-(biphenyl-4-yl)-N-hydroxy-8-(hydroxyimino)octanamide 8-Biphenyl-4-yl-8-hydroxyimino-octanoic acid hydroxyamide | CHEMBL95552
TypeSmall organic molecule
Emp. Form.C20H24N2O3
Mol. Mass.340.4162
SMILESONC(=O)CCCCCCC(N=O)c1ccc(cc1)-c1ccccc1