Reaction Details
TargetCoagulation factor X
LigandBDBM50295586
Substrate/Competitorn/a
Meas. Tech.ChEMBL_577597 (CHEMBL1059506)
Ki 1272±n/a nM
Citation Zbinden, KGAnselm, LBanner, DWBenz, JBlasco, FDécoret, GHimber, JKuhn, BPanday, NRicklin, FRisch, PSchlatter, DStahl, MThomi, SUnger, RHaap, W Design of novel aminopyrrolidine factor Xa inhibitors from a screening hit. Eur J Med Chem44:2787-95 (2009) 
 
Coagulation factor X
Name:Coagulation factor X
Type:Enzyme
Mol. Mass.:54726.60
Organism:Homo sapiens (Human)
Description:n/a
Residue:488
BDBM50295586
NameBDBM50295586
Synonyms:(S)-4-chloro-N-(1-(2-(2-fluoro-4-(2-oxopyridin-1(2H)-yl)phenylamino)-2-oxoethyl)pyrrolidin-3-yl)cyclopenta-1,3-dienecarboxamide | CHEMBL552115
TypeSmall organic molecule
Emp. Form.C22H20ClFN4O3S
Mol. Mass.474.936
SMILESFc1cc(ccc1NC(=O)CN1CC[C@@H](C1)NC(=O)c1ccc(Cl)s1)-n1ccccc1=O