Reaction Details
TargetProthrombin
LigandBDBM50295574
Substrate/Competitorn/a
Meas. Tech.ChEMBL_577598 (CHEMBL1059507)
Ki 2800±n/a nM
Citation Zbinden, KGAnselm, LBanner, DWBenz, JBlasco, FDécoret, GHimber, JKuhn, BPanday, NRicklin, FRisch, PSchlatter, DStahl, MThomi, SUnger, RHaap, W Design of novel aminopyrrolidine factor Xa inhibitors from a screening hit. Eur J Med Chem44:2787-95 (2009) 
 
Prothrombin
Name:Prothrombin
Type:Protein
Mol. Mass.:70029.57
Organism:Homo sapiens (Human)
Description:P00734
Residue:622
BDBM50295574
NameBDBM50295574
Synonyms:4-chloro-N-(4-(2-oxo-2-(4-(2-oxo-2-(pyrrolidin-1-yl)ethyl)piperazin-1-yl)ethyl)thiazol-2-yl)benzamide | CHEMBL560319
TypeSmall organic molecule
Emp. Form.C22H26ClN5O3S
Mol. Mass.475.992
SMILESClc1ccc(cc1)C(=O)Nc1nc(CC(=O)N2CCN(CC(=O)N3CCCC3)CC2)cs1