Reaction Details
TargetCoagulation factor X
LigandBDBM50295588
Substrate/Competitorn/a
Meas. Tech.ChEMBL_577597 (CHEMBL1059506)
Ki 3±n/a nM
Citation Zbinden, KGAnselm, LBanner, DWBenz, JBlasco, FDécoret, GHimber, JKuhn, BPanday, NRicklin, FRisch, PSchlatter, DStahl, MThomi, SUnger, RHaap, W Design of novel aminopyrrolidine factor Xa inhibitors from a screening hit. Eur J Med Chem44:2787-95 (2009) 
 
Coagulation factor X
Name:Coagulation factor X
Type:Enzyme
Mol. Mass.:54726.60
Organism:Homo sapiens (Human)
Description:n/a
Residue:488
BDBM50295588
NameBDBM50295588
Synonyms:5-chloro-N-((3S,4S)-1-(2-(2-fluoro-4-(2-oxopyridin-1(2H)-yl)phenylamino)-2-oxoethyl)-4-methoxypyrrolidin-3-yl)thiophene-2-carboxamide CHEMBL551393
TypeSmall organic molecule
Emp. Form.C23H22ClFN4O4S
Mol. Mass.504.962
SMILESCO[C@H]1CN(CC(=O)Nc2ccc(cc2F)-n2ccccc2=O)C[C@@H]1NC(=O)c1ccc(Cl)s1