Reaction Details
TargetCoagulation factor X
LigandBDBM50295591
Substrate/Competitorn/a
Meas. Tech.ChEMBL_577597 (CHEMBL1059506)
Ki 22±n/a nM
Citation Zbinden, KGAnselm, LBanner, DWBenz, JBlasco, FDécoret, GHimber, JKuhn, BPanday, NRicklin, FRisch, PSchlatter, DStahl, MThomi, SUnger, RHaap, W Design of novel aminopyrrolidine factor Xa inhibitors from a screening hit. Eur J Med Chem44:2787-95 (2009) 
 
Coagulation factor X
Name:Coagulation factor X
Type:Enzyme
Mol. Mass.:54726.60
Organism:Homo sapiens (Human)
Description:n/a
Residue:488
BDBM50295591
NameBDBM50295591
Synonyms:5-chloro-N-((3S,4S)-1-(2-(2-fluoro-4-(2-oxopyridin-1(2H)-yl)phenylamino)-2-oxoethyl)-4-(2-hydroxyethoxy)pyrrolidin-3-yl)thiophene-2-carboxamide | CHEMBL558637
TypeSmall organic molecule
Emp. Form.C24H24ClFN4O5S
Mol. Mass.534.988
SMILESOCCO[C@H]1CN(CC(=O)Nc2ccc(cc2F)-n2ccccc2=O)C[C@@H]1NC(=O)c1ccc(Cl)s1