Reaction Details
TargetCoagulation factor X
LigandBDBM50295596
Substrate/Competitorn/a
Meas. Tech.ChEMBL_577597 (CHEMBL1059506)
Ki 95±n/a nM
Citation Zbinden, KGAnselm, LBanner, DWBenz, JBlasco, FDécoret, GHimber, JKuhn, BPanday, NRicklin, FRisch, PSchlatter, DStahl, MThomi, SUnger, RHaap, W Design of novel aminopyrrolidine factor Xa inhibitors from a screening hit. Eur J Med Chem44:2787-95 (2009) 
 
Coagulation factor X
Name:Coagulation factor X
Type:Enzyme
Mol. Mass.:54726.60
Organism:Homo sapiens (Human)
Description:n/a
Residue:488
BDBM50295596
NameBDBM50295596
Synonyms:5-CHLORO-THIOPHENE-2-CARBOXYLIC ACID ((3R,5S)-1-{[2-FLUORO-4-(2-OXO-PYRIDIN-1-YL)-PHENYLCARBAMOYL]-METHYL}-5-HYDROXYMETHYL-PYRROLIDIN-3-YL)-AMIDE CHEMBL550102
TypeSmall organic molecule
Emp. Form.C23H22ClFN4O4S
Mol. Mass.504.962
SMILESOC[C@@H]1C[C@H](CN1CC(=O)Nc1ccc(cc1F)-n1ccccc1=O)NC(=O)c1ccc(Cl)s1